Genkeys Error

Hi All , I am getting Ant Run Failed Error while installing genkeys in linux. Please help me in resolving this.

Targets:install-genkeys
Buildfile: /tmp/antinstall1/build.xml

app-logging:
[echo]
[echo] ************************************************************
[echo] * InstallX: Oracle Retail | Xstore GenKeys
[echo] * Version: 15.0.0.549 - 0.0.0 - 0.0
[echo] *
[echo] * Run By: oracle
[echo] * JVM: Oracle Corporation v23.21-b01
[echo] * OS: Linux v3.8.13-35.3.1.el7uek.x86_64
[echo] *
[echo] * CUSTOMER: XST | INSTALL DIR: /u01/xstore-genkeys
[echo] * TYPE: install | OS: linux_64 | DB: oracle
[echo] * STARTED: Saturday, May 13, 2017 02:44:28 AM EDT
[echo] ************************************************************
[echo]

add-exec-pre:

custom-pre:

common-process-start:

app-backup:

app-install:
[unzip] Expanding: /tmp/antinstall1/xstore-genkeys.zip into /u01/xstore-genkeys
[mkdir] Created dir: /u01/xstore-genkeys/tmp

fix-line-feeds-and-file-permission:

error:
BUILD FAILED
/tmp/antinstall1/build.xml:44: /u01/xstore-genkeys/bin does not exist.

Total time: 3 seconds
org.tp23.antinstaller.InstallException: Error running the install, Ant run failed - examine the error logs for details
at org.tp23.antinstaller.runtime.exe.AntLauncherFilter.exec(AntLauncherFilter.java:89)
at org.tp23.antinstaller.runtime.ExecInstall.exec(ExecInstall.java:87)
at org.tp23.antinstaller.selfextract.SelfExtractor.main(SelfExtractor.java:137)
Caused by: org.tp23.antinstaller.InstallException: Ant run failed - examine the error logs for details
at org.tp23.antinstaller.runtime.exe.AntLauncherFilter.exec(AntLauncherFilter.java:79)
… 2 more
— Nested Exception —
org.tp23.antinstaller.InstallException: Ant run failed - examine the error logs for details
at org.tp23.antinstaller.runtime.exe.AntLauncherFilter.exec(AntLauncherFilter.java:79)
at org.tp23.antinstaller.runtime.ExecInstall.exec(ExecInstall.java:87)
at org.tp23.antinstaller.selfextract.SelfExtractor.main(SelfExtractor.java:137)